{"text_format":"1","workbook":"xlsx","n_sheets":11,"sheets":["Polročná_správa","P1Základné údaje","P8Súvaha podľa IAS","P9Výkaz ZaS podľa IAS","P10Výkaz zmien vo VI podľa IAS","P11Výkaz PT podľa IAS","P14KonsolSúvaha podľa IAS","P15Konsol výkaz ZaS podľa IAS","P16Výkaz zmien vo VI podľa IAS","P17Výkaz PT podľa IAS","KONTROLA"],"not_rendered":{"charts":0,"images":0,"macros":0,"external_links":0,"defined_names":1,"comments":0,"pivot_tables":0},"unopened":[],"bounds":{"document_bytes":16777216,"sheet_cells":100000,"rows_first":2000,"rows_last":500,"rows_between":2000,"halvings":0,"cell_chars":16384,"cell_head_chars":4096},"cells_cut":0,"cells_raw":0,"read":"whole","date_system":"1900"}

{"sheet":"Polročná_správa","index":0,"n_rows":179,"n_cols":7,"rows_kept":179,"cut":false,"hidden":false,"merged":[[26,1,26,8],[20,5,20,8],[39,5,39,8],[0,2,0,4],[3,0,3,1],[24,1,24,8],[22,5,22,8],[34,0,39,0],[34,1,39,1],[39,2,39,4],[28,4,28,5],[37,2,38,4],[34,5,36,8],[37,5,38,8],[28,6,28,8],[28,1,28,2],[1,0,1,8],[16,1,16,8],[18,1,18,8],[5,4,5,8],[9,1,9,8],[11,1,11,8],[53,2,53,4],[55,2,55,4],[55,5,55,8],[54,2,54,4],[56,2,56,4],[30,1,32,8],[53,5,53,8],[34,2,36,4],[49,0,49,2],[54,5,54,8],[53,0,53,1],[2,1,2,5],[14,1,14,8],[15,1,15,8],[13,1,13,2],[30,0,32,0],[51,0,51,5],[42,1,47,8],[51,6,51,8],[63,5,64,8],[70,0,71,8],[64,0,65,1],[66,5,66,8],[65,5,65,8],[68,5,68,8],[69,0,69,8],[67,5,67,8],[66,2,66,4],[58,0,58,1],[54,0,57,1],[58,2,58,4],[58,5,58,8],[57,2,57,4],[57,5,57,8],[56,5,56,8],[59,0,59,1],[59,5,60,8],[60,0,60,1],[67,2,67,4],[62,5,62,8],[62,0,62,1],[62,2,62,4],[59,2,60,4],[65,2,65,4],[88,0,88,5],[81,0,81,8],[74,0,74,8],[75,0,79,8],[72,0,72,4],[63,2,64,4],[63,0,63,1],[66,0,68,1],[68,2,68,4],[90,0,95,1],[137,0,138,8],[174,0,177,8],[148,0,153,8],[154,0,164,8],[167,0,170,8],[171,0,172,8],[139,0,144,8],[147,0,147,8],[82,0,83,8],[130,0,135,8],[90,5,91,8],[90,2,91,4],[95,5,95,8],[94,2,94,4],[95,2,95,4],[94,5,94,8],[93,5,93,8],[92,2,92,4],[92,5,92,8],[97,0,97,8],[128,0,129,8],[120,0,120,8],[102,0,117,8],[119,0,119,8],[98,0,98,8],[121,0,126,8],[100,0,101,8],[93,2,93,4]]}
["regulovaná informácia",null,"POLROČNÁ SPRÁVA"]
["emitenta akcií alebo dlhových cenných papierov, ktoré boli prijaté na obchodovanie na regulovanom trhu"]
[null,"v zmysle zákona o burze cenných papierov"]
["Časť 1.- Identifikácia emitenta"]
[]
["Informačná povinnosť za polrok:","2015",null,"IČO:","36 005 622"]
[]
["Účtovné obdobie:","od:","1.1.2015","do:","30.6.2015"]
[]
["Právna forma","akciová spoločnosť"]
[]
["Obchodné meno / názov:","Hornonitrianske bane Prievidza, a.s. v skratke HBP, a.s."]
[]
["Sídlo:"]
["ulica, číslo","Matice slovenskej č. 10"]
["PSČ","971 01"]
["Obec","Prievidza"]
[]
["Kontaktná osoba:","Ing. Romana Obertášová, odbor organizačno-právny"]
[]
["Tel.:","smerové číslo","046",null,"číslo:","542 50 01"]
[]
["Fax:","smerové číslo","046",null,"číslo:","541 21 06"]
[]
["E-mail:","robertasova@hbp.sk"]
[]
["Webové sídlo:","www.hbp.sk"]
[]
["Dátum vzniku:","1.7.1996",null,null,"Základné imanie (v EUR):",null,"99 651 879,73"]
[]
["Zakladateľ:","Fond národného majetku SR"]
[]
[]
[]
["Oznámenie spôsobu zverejnenia polročnej finančnej správy                  § 47 ods. 4 zákona o burze","webové sídlo emitenta, denná tlač s celoštátnou pôsobnosťou, CERI","Adresa internetovej stránky emitenta, alebo názov dennej tlače, alebo názov všeobecne uznávaného informačného systému, v ktorej bola polročná finančná správa zverejnená ",null,null,"www.hbp.sk               Hospodárske noviny               ceri-submit@nbs.sk"]
[]
[]
[null,null,"Dátum zverejnenia",null,null,"31.08.2015"]
[]
[null,null,"Čas zverejnenia                    § 47 ods. 8 zákona o burze",null,null,"31.08.2015"]
[]
[]
["Predmet podnikania:","a) Banská činnosť a s ňou súvisiaca v súlade s oprávnením Obvodného banského úradu Prievidza č. 1110/96 zo dňa 18.7.1996, ťažba a predaj hnedého uhlia, b) banská záchranná služba, záchranárska činnosť pri závažných prevádzkových nehodách, c!) cestná doprava, d) ubytovacie služby"]
[]
[]
[]
[]
[]
[]
["Časť 2. Účtovná závierka"]
[]
["Priebežná účtovná závierka je zostavená podľa SAS(Slovenské štandardy), alebo podľa IAS/IFRS (medzinárodné štandardy)",null,null,null,null,null,"IAS/IFRS"]
[]
["Priebežná  účtovná závierka podľa SAS",null,"Účtovná závierka-základné údaje",null,null,"Príloha č. 1 (P1Účtovná závierka)"]
["Tieto formuláre sú pre emitentov cenných papierov, ktorí zostavujú účtovnú závierku podľa slovenských účtovných štandardov.",null,"Súvaha priebežnej účtovnej závierky-aktíva                       BO: 30.6.  PO: 31.12.",null,null,"Príloha č. 2 (P2Súvaha-aktíva)"]
[null,null,"Súvaha priebežnej účtovnej závierky-pasíva                      BO: 30.6.  PO: 31.12.",null,null,"Príloha č. 3 (P3Súvaha-pasíva)"]
[null,null,"Výkaz ziskov  a strát priebežnej účtovnej závierky                                       BO: 30.6.  PO: 30.6.",null,null,"Príloha č. 4 (P4Výkaz ziskov a strát)"]
[null,null,"Poznámky priebežnej účtovnej závierky",null,null,"Príloha č. 5 (P5Poznámky)"]
["V  § 35 ods. 5, 6, 7 zákona o burze je ustanovený minimálny obsah skrátenej priebežnej účtovnej závierky",null,"CASH-FLOW-Priama metóda                                               BO: 30.6.  PO: 30.6.",null,null,"Príloha č. 6 (P6CASH-FLOW-Priama metóda)"]
[null,null,"CASH-FLOW-Nepriama metóda                                    BO: 30.6.  PO: 30.6.",null,null,"Príloha č. 7 (P7CASH FLOW-Nepriama metóda)"]
[]
["alebo"]
["Priebežná  účtovná závierka podľa IAS/IFRS",null,"Účtovná závierka-základné údaje",null,null,"Príloha č. 1 (P1Účtovná závierka)"]
["UPOZORNENIE                                                                 ",null,"Výkaz o finančnej situácii priebežnej účtovnej závierky podľa IAS/IFRS",null,null,"Príloha č. 8 (P8Súvaha podľa IAS/IFRS)"]
["Podľa § 17a ods. 3 zákona o účtovníctve účtovná jednotka okrem účtovnej jednotky podľa § 17a ods.1 zákona o účtovníctve, ktorá v účtovnom období emitovala cenné papiere a tieto boli prijaté na obchodovanie na regulovanom trhu, ktorá nespĺňa podmienky podľa  § 17a ods. 2 zákona o účtovníctve, zostavuje individuálnu účtovnú závierku podľa medzinárodných účtovných štandardov ak sa tak rozhodne."]
[null,null,"Výkaz komplexného výsledku priebežnej účtovnej závierky podľa IAS/IFRS",null,null,"Príloha č. 9 (P9Výkaz ZaS podľa IAS/IFRS)"]
["V zmysle § 17a zákona o účtovníctve banky a poisťovne zostavujú účtovnú závierku podľa IAS/IFRS.",null,"Výkaz zmien vo vlastnom imaní podľa IAS/IFRS",null,null,"Príloha č. 10 (P10Výkaz zmien vo VI podľa IAS/IFRS)"]
[null,null,"Výkaz peňažných tokov podľa IAS/IFRS",null,null,"Príloha č. 11 (P11Výkaz PT podľa IAS/IFRS)"]
[null,null,"Poznámky podľa IAS/IFRS",null,null,"Príloha č. 13 (P13Poznámky podľa IAS/IFRS)"]
[]
["(§ 35 ods. 11 zákona o burze) Ak polročná finančná správa nebola overená alebo preverená audítorom, emitent uvedie o tejto skutočnosti vo svojej správe vyhlásenie !"]
[]
["Polročná finančná správa bola overená, alebo preverená audítorom (u polročnej správy nie je povinnosť)  (áno/nie)",null,null,null,null,"nie"]
[]
["Vyhlásenie emitenta podľa § 35 ods. 11 zákona o burze o tom, že polročná správa nebola overená alebo preverená audítorom "]
["Priebežná individuálna účtovná závierka spoločnosti HBP, a.s. zostavená v súlade s Medzinárodnými štandardami pre finančné výkazníctvo k 30. júnu 2015 nebola overená audítorom (viď Vyhlásenie vedenia spoločnosti), príloha P12."]
[]
[]
[]
[]
[]
["Obchodné meno audítorskej spoločnosti, sídlo / číslo licencie alebo meno a priezvisko audítora, adresa/číslo licencie:"]
[]
[]
[]
["Dátum auditu:"]
[]
["§ 35 ods. 3 zákona o burze"]
["1. Zostavuje konsolidovanú účtovnú závierku  (áno/ v prípade, že nezostavuje uviesť nie)",null,null,null,null,null,"áno"]
[]
["Priebežná  konsolidovaná účtovná závierka podľa IAS/IFRS",null,"Výkaz o finančnej situácii podľa IAS/IFRS",null,null,"Príloha č. 14 (P14Súvaha podľa IAS/IFRS)"]
[]
[null,null,"Výkaz komplexného výsledku podľa IAS/IFRS",null,null,"Príloha č. 15 (P15Výkaz ZaS podľa IAS/IFRS)"]
[null,null,"Výkaz zmien vo vlastnom imaní podľa IAS/IFRS",null,null,"Príloha č. 16 (P16Výkaz zmien vo VI podľa IAS/IFRS)"]
[null,null,"Výkaz peňažných tokov podľa IAS/IFRS",null,null,"Príloha č. 17 (P17Výkaz PT podľa IAS/IFRS)"]
[null,null,"Poznámky podľa IAS/IFRS",null,null,"Príloha č. 18 (P18Poznámky podľa IAS/IFRS)"]
[]
["Časť 3. Priebežná správa "]
["Podľa § 35 ods. 2 písm. a) polročná správa obsahuje priebežnú správu vypracovanú v súlade s § 35 ods. 9 zákona o burze"]
[]
["Priebežná správa obsahuje najmä uvedenie dôležitých udalostí, ku ktorým došlo v prvých šiestich mesiacoch účtovného obdobia, a ich dopad na priebežnú účtovnú závierku v skrátenej štruktúre spolu s opisom hlavných rizík a neistôt na zostávajúcich šesť mesiacov účtovného obdobia. "]
[]
["Spoločnosť hospodárila bez mimoriadnych udalostí a zabezpečovala dostatočnú tvorbu finančných zdrojov na krytie investičných a prevádzkových potrieb. Kladný výsledok hospodárenia  972 045 €  k 30.6.2015 bol dosiahnutý predovšetkým priaznivými výrobnými výsledkami v ťažbe a kvalite uhlia a je v súlade s podnikateľským plánom. V hodnotenom období 1. polroka 2015 a.s. vyťažila 959 200 ton uhlia, čo predstavuje 53,1 % plánovanej ročnej produkcie. Priaznivé výsledky hospodárenia boli dosiahnuté hlavne v mesiacoch január - máj 2015. Spoločnosť okrem otvorených polí v hodnotenom období pokračovala v priprave ťažobnej základe na 12. ŤÚ Bane Handlová a začala prípravu znovuobnovenia ťažby v 6. ŤÚ Bane Nováky. Pozitívne výsledky hospodárenia a.s. dosiahla okrem produktu uhlie aj v produkte záchranárska činnosť v o.z. Hlavná banská záchranná stanica. Vývoj výsledku hospodárenia ovplyvnilo náročné riadenie v oblasti nákladov, s úspornými opatreniami v oblasti spotreby materiálu a energií. V hodnotenom období a.s. udržiavala stabilnú zamestnanosť, s priemerným stavom 3 509 zamestnancov. V ďalšom období a.s. pokračuje v realizácii hospodárenia v zmysle podnikateľského plánu."]
[]
[]
[]
[]
[]
[]
[]
[]
[]
[]
[]
[]
[]
[]
[]
[]
["Ak ide o emitentov akcií, zahŕňa priebežná správa aj významné obchody so spriaznenými osobami, a to"]
["a) obchody, ku ktorým došlo v prvých šiestich mesiacoch aktuálneho účtovného obdobia a ktoré podstatne ovplyvnili finančné postavenie alebo činnosť emitenta v tomto období"]
["V hodnotenom období pokračovali štandardné obchodné vzťahy. Významný podiel tvoria obchody s hlavným odberateľom energetického uhlia Slovenskými elektrárňami, a.s. Obchody so spriaznenými osobami  sú uvádzané v Poznámkach k priebežnej skrátenej individuálnej účtovnej závierke v Poznámke č.31 (Prílohač.13P13 Poznámky podľa ISA/IFRS)."]
[]
[]
[]
[]
[]
[]
["b) akékoľvek zmeny o týchto obchodoch uvedené v poslednej ročnej finančnej správe, ktoré by mohli mať podstatný vplyv na finančné postavenie alebo činnosť emitenta počas prvých šiestich mesiacov aktuálneho účtovného obdobia"]
[]
["Obchody boli vykonávané plynule podľa ťažby uhlia, so zabezpečením odbytu do ENO Zemianske Kostoľany. Nenastali žiadne zmeny v obchodoch, ktoré by mohli mať vplyv na finančné postavenie a činnosť emitenta."]
[]
[]
[]
[]
[]
[]
["Podľa § 35 ods. 10) zákona o burze ak emitent nie je povinný zostaviť konsolidovanú účtovnú závierku, v priebežnej správe sa uvedú najmä obchody so spriaznenými osobami."]
[]
["Spoločnosť zostavuje konsolidovanú účtovnú závierku."]
[]
[]
[]
[]
[]
[]
[]
["§ 35 ods. 2 písm. c) zákona o burze"]
["vyhlásenie zodpovedných osôb emitenta so zreteľným označením ich mena, priezviska a funkcie o tom, že podľa ich najlepších znalostí poskytuje priebežná účtovná závierka vypracovaná v súlade s osobitnými predpismi pravdivý a verný obraz aktív, pasív, finančnej situácie a hospodárskeho výsledku emitenta a spoločností zaradených do celkovej konsolidácie podľa požiadaviek uvedených odsekoch 3 a 4 § 35 zákona o burze a že uvedená priebežná správa obsahuje verný prehľad informácií podľa odseku 9 § 35 zákona o burze."]
[]
[]
[]
[]
[]
["Vyhlásenie vedenia spoločnosti je uvedené v samostatnej prílohe P12."]
[]
[]
[]
[]
[]
[]
[]
[]
[]
[]
[]
[]
[]
[]
[]
[]
["                      Dr. h.c. Ing. Peter Čičmanec, PhD., v.r.                                                                   Ing. Daniel Rexa, v.r.                                                                                                                                                                                                                                             "]
[]
["                            predseda predstavenstva",null,null,"       člen predstavenstva"]
[]
[]
[]
[]
["                       V Prievidzi,  31.8.2015"]

{"sheet":"P1Základné údaje","index":1,"n_rows":28,"n_cols":26,"rows_kept":28,"cut":false,"hidden":false,"merged":[[7,2,7,32],[11,0,11,32],[12,0,12,32],[25,7,25,15],[25,25,25,32],[23,4,23,32],[26,16,28,24],[25,0,25,6],[26,25,28,32],[28,0,28,6],[25,16,25,24],[23,0,23,2],[27,0,27,6],[26,0,26,6],[26,7,28,15],[4,25,4,32],[4,8,4,24],[15,0,15,32],[17,0,17,6],[21,0,21,7],[10,0,10,32],[9,0,9,32],[20,10,20,20],[7,0,7,1],[14,0,14,32],[20,22,20,32],[20,0,20,7],[21,22,21,32],[21,10,21,20],[0,0,0,35],[2,0,2,35],[3,0,3,35],[18,0,18,6],[18,8,18,32],[17,8,17,31]]}
["Základné údaje k priebežnej účtovnej závierke"]
[]
["ÚČTOVNÁ ZÁVIERKA"]
["( INDIVIDUÁLNA )"]
[null,null,null,null,null,null,"k    ",null,"30.6.2015",null,null,null,null,null,null,null,null,null,null,null,null,null,null,null,null,"(v  celých eurách)"]
[]
[]
["IČO:",null,{"$f":"IF(ISBLANK(Polročná_správa!E6),\"  \",Polročná_správa!E6)","v":"36 005 622"}]
[]
["Obchodné meno  ( názov účtovnej jednotky)"]
[{"$f":"IF(ISBLANK(Polročná_správa!B12),\"  \",Polročná_správa!B12)","v":"Hornonitrianske bane Prievidza, a.s. v skratke HBP, a.s."}]
["Právna forma"]
[{"$f":"IF(ISBLANK(Polročná_správa!B10),\"  \",Polročná_správa!B10)","v":"akciová spoločnosť"}]
[]
["Sídlo účtovnej jednotky,  ulica a číslo"]
[{"$f":"IF(ISBLANK(Polročná_správa!B15),\"  \",Polročná_správa!B15)","v":"Matice slovenskej č. 10"}]
[]
["PSČ",null,null,null,null,null,null,null,"Názov obce"]
[{"$f":"IF(ISBLANK(Polročná_správa!B16),\"  \",Polročná_správa!B16)","v":"971 01"},null,null,null,null,null,null,null,{"$f":"IF(ISBLANK(Polročná_správa!B17),\"  \",Polročná_správa!B17)","v":"Prievidza"}]
[]
["Smerové číslo telefónu:",null,null,null,null,null,null,null,null,null,"Číslo telefónu:",null,null,null,null,null,null,null,null,null,null,null,"Číslo faxu:"]
[{"$f":"IF(ISBLANK(Polročná_správa!C21),\"  \",Polročná_správa!C21)","v":"046"},null,null,null,null,null,null,null,null,null,{"$f":"IF(ISBLANK(Polročná_správa!F21),\"  \",Polročná_správa!F21)","v":"542 50 01"},null,null,null,null,null,null,null,null,null,null,null,{"$f":"IF(ISBLANK(Polročná_správa!F23),\"  \",Polročná_správa!F23)","v":"541 21 06"}]
[]
["e-mail: ",null,null,null,{"$f":"IF(ISBLANK(Polročná_správa!B25),\"  \",Polročná_správa!B25)","v":"robertasova@hbp.sk"}]
[]
[" Zostavená dňa:",null,null,null,null,null,null,"Osoba zodpovedná za vedenie účtovníctva:",null,null,null,null,null,null,null,null,"Osoba  zodpovedná za zostavenie účtovnej závierky:",null,null,null,null,null,null,null,null,"Zástupca štatutárneho orgánu účtovnej jednotky alebo fyzickej osoby, ktorá je účtovnou jednotkou:"]
["          29.07.2015",null,null,null,null,null,null,"Ing. Tatiana Mellová",null,null,null,null,null,null,null,null,"Ing. Daniel Rexa",null,null,null,null,null,null,null,null,"Dr.h.c. Ing. Peter Čičmanec, PhD."]
[" Schválená dňa:"]

{"sheet":"P8Súvaha podľa IAS","index":2,"n_rows":51,"n_cols":5,"rows_kept":51,"cut":false,"hidden":false,"merged":[[67,0,67,1],[68,0,68,1],[73,0,73,1],[71,0,71,1],[72,0,72,1],[69,0,69,1],[70,0,70,1],[55,0,55,1],[66,0,66,1],[65,0,65,1],[58,0,58,1],[59,0,59,1],[60,0,60,1],[61,0,61,1],[62,0,62,1],[63,0,63,1],[64,0,64,1],[6,4,7,4],[4,2,4,4],[1,2,1,4],[6,5,7,5],[57,0,57,1],[51,0,51,1],[56,0,56,1],[52,0,52,1],[53,0,53,1],[54,0,54,1],[0,0,0,4],[2,0,2,1],[2,2,2,4],[6,2,7,2],[6,0,7,1],[3,0,3,1],[3,2,3,4],[6,3,7,3],[1,0,1,1],[4,0,4,1]]}
["Výkaz o finančnej situácii priebežnej účtovnej závierky (v EUR)"]
["Za obdobie od do:",null,"1.1.2015 - 30.6.2015"]
["Bezprostredne predchádzajúce obdobie od do:",null,"1.1.2014 - 31.12.2014"]
["Názov účtovnej jednotky:",null,{"$f":"IF(ISBLANK(Polročná_správa!B12),\"  \",Polročná_správa!B12)","v":"Hornonitrianske bane Prievidza, a.s. v skratke HBP, a.s."}]
["IČO:",null,{"$f":"IF(ISBLANK(Polročná_správa!E6),\"  \",Polročná_správa!E6)","v":"36 005 622"}]
[]
["Názov položky",null,"Bod poznámok","Vykazované  obdobie","Predchádzajúce účtovné obdobie"]
[null,null,null,null,"Netto"]
[null,"MAJETOK"]
[null,"Neobežný majetok "]
[null,"Pozemky, budovy, zariadenia",3,54837723,64306028]
[null,"Nehmotný dlhodobý majetok",4,73462,87118]
[null,"Ostatný finančný majetok","5",15762944,10715110]
[null,"Investície do nehnuteľností","6",5707258,5492712]
[null,"Investície do dcérskych spoločností","7",1022435,1022435]
[null,"Investície do pridružených spoločností","8",6216919,6216919]
[null,"Neobežný majetok spolu",null,83620741,87840322]
[]
[null,"Obežný majetok"]
[null,"Zásoby ","9",6066069,7140668]
[null,"Obchodné a ostatné pohľadávky","10",18672180,18491266]
[null,"Ostatný finančný majetok","11",1587732,1482561]
[null,"Peňažné prostriedky a peňažné ekvivalenty",null,13298302,7279977]
[null,"Neobežný majetok držaný na predaj","12",56298,56232]
[null,"Obežný majetok spolu",null,39680581,34450704]
[null,"Majetok spolu ",null,123301322,122291026]
[]
[]
[null,"VLASTNÉ  IMANIE A ZÁVÄZKY "]
[null,"Vlastné imanie "]
[null,"Základné imanie ","13",99651880,99651880]
[null,"Kapitálové rezervy","14",6461285,6364849]
[null,"Nerozdelené zisky (straty)","15",-27788675,-28664284]
[null,"Vlastné imanie spolu",null,78324490,77352445]
[]
[null,"Neobežné záväzky "]
[null,"Bankové úvery","16",5084731,3948000]
[null,"Zamestnanecké požitky ","17",3440917,3954738]
[null,"Záväzky z finančného leasingu","18",null,0]
[null,"Rezerva na rekultivácie nehnuteľností","18",9646185,9657420]
[null,"Obchodné a ostatné dlhodobé záväzky","19",5371859,5914420]
[null,"Neobežné záväzky spolu",null,23543692,23474578]
[]
[null,"Obežné záväzky "]
[null,"Obchodné a ostatné záväzky","19",13780094,15115335]
[null,"Daň z príjmov",null,0,2880]
[null,"Zamestnanecké požitky ","17",915446,493788]
[null,"Bankové úvery a kontokorentné účty","16",6737600,5852000]
[null,"Obežné záväzky spolu",null,21433140,21464003]
[null,"Záväzky spolu",null,44976832,44938581]
[null,"Vlastné imanie a záväzky spolu ",null,123301322,122291026]

{"sheet":"P9Výkaz ZaS podľa IAS","index":3,"n_rows":32,"n_cols":7,"rows_kept":32,"cut":false,"hidden":false,"merged":[[65,0,65,1],[69,0,69,1],[72,0,72,1],[70,0,70,1],[71,0,71,1],[68,0,68,1],[60,0,60,1],[61,0,61,1],[53,0,53,1],[64,0,64,1],[63,0,63,1],[67,0,67,1],[66,0,66,1],[54,0,54,1],[55,0,55,1],[37,0,37,1],[38,0,38,1],[42,0,42,1],[43,0,43,1],[39,0,39,1],[41,0,41,1],[49,0,49,1],[51,0,51,1],[62,0,62,1],[59,0,59,1],[40,0,40,1],[47,0,47,1],[48,0,48,1],[44,0,44,1],[56,0,56,1],[57,0,57,1],[58,0,58,1],[50,0,50,1],[52,0,52,1],[32,0,32,1],[46,0,46,1],[33,0,33,1],[34,0,34,1],[45,0,45,1],[35,0,35,1],[36,0,36,1],[4,2,4,6],[6,0,7,1],[6,2,7,2],[6,3,7,3],[6,4,7,4],[6,6,7,6],[4,0,4,1],[0,0,0,6],[2,0,2,1],[2,2,2,6],[3,0,3,1],[3,2,3,6],[1,0,1,1],[1,2,1,6]]}
["Výkaz komplexného výsledku priebežnej účtovnej závierky (v EUR)"]
["Za obdobie od do:",null,"1.1.2015 - 30.6.2015"]
["Bezprostredne predchádzajúce obdobie od do:",null,"1.1.2014 - 30.6.2014"]
["Názov účtovnej jednotky:",null,{"$f":"IF(ISBLANK(Polročná_správa!B12),\"  \",Polročná_správa!B12)","v":"Hornonitrianske bane Prievidza, a.s. v skratke HBP, a.s."}]
["IČO:",null,{"$f":"IF(ISBLANK(Polročná_správa!E6),\"  \",Polročná_správa!E6)","v":"36 005 622"}]
[]
["Názov položky",null,"Bod poznámok","Vykazované  obdobie","Porovnateľné obdobie bezprostredne predchádzajúceho účtovného obdobia",null,"Bezprostredne nasledujúce účtovné obdobie (predpoklad)"]
[null,null,null,null,"Netto",null,"Netto"]
["Výnosy",null,20,61895820,58534135,null,121611300]
[]
["Ostatné prevádzkové výnosy",null,21,615113,403162,null,1089900]
["Zmeny stavu zásob a aktivované vlastné výkony",null,22,-368003,5359888,null,-3590000]
["Spotreba surovín, materiálu a služieb ",null,null,-23575960,-26651514,null,-50109700]
["Náklady na zamestnanecké požitky",null,null,-26635007,-26848842,null,-54540000]
["Odpisy  ",null,null,-5092222,-3732886,null,-7045800]
["Zmena poklesu hodnoty neobežného majetku",null,23,-4928974,0,null,-4930000]
["Ostatné prevádzkové náklady",null,24,-825891,-722637,null,-1095400]
["Prevádzkový zisk/(strata)",null,null,1084876,6341306,null,{"$f":"G9+G11+G12+G13+G14+G15+G16+G17","v":1390300}]
["Finančné výnosy",null,null,218951,377924,null,401500]
["Finančné náklady ",null,null,-331417,-289968,null,-729000]
["Finančné výnosy/(náklady) netto ",null,25,-112466,87956,null,{"$f":"G18+G19+G20","v":1062800}]
["Zisk pred zdanením",null,null,972410,6429262,null,{"$f":"G21","v":1062800}]
["Daň z príjmov",null,26,-365,-376,null,-700]
["Zisk za obdobie",null,null,972045,6428886,null,{"$f":"G22+G23","v":1062100}]
[]
["Celkový komplexný výsledok za obdobie",null,null,972045,6428886,null,{"$f":"G24","v":1062100}]
[]
["Zisk na akciu"]
["Základný",null,null,0.32400000000000001,2.141]
["Redukovaný",null,null,0.32400000000000001,2.141]
["Poznámka :"]
["V bezprostrednom nasledujúcom účtovnom období je uvedená očakávaná skutočnosť roku 2015"]

{"sheet":"P10Výkaz zmien vo VI podľa IAS","index":4,"n_rows":35,"n_cols":9,"rows_kept":35,"cut":false,"hidden":false,"merged":[[48,2,48,3],[60,2,60,3],[51,2,51,3],[53,2,53,3],[71,11,71,12],[72,11,72,12],[73,8,73,10],[73,11,73,12],[37,2,37,3],[71,8,71,10],[52,2,52,3],[45,2,45,3],[46,2,46,3],[47,2,47,3],[68,11,68,12],[69,8,69,10],[69,11,69,12],[70,11,70,12],[74,11,74,12],[65,8,65,10],[65,11,65,12],[66,11,66,12],[67,8,67,10],[67,11,67,12],[64,11,64,12],[63,5,63,7],[72,8,72,10],[70,8,70,10],[68,8,68,10],[60,11,60,12],[66,8,66,10],[63,8,63,10],[64,8,64,10],[61,8,61,10],[61,11,61,12],[62,5,62,7],[62,8,62,10],[62,11,62,12],[61,5,61,7],[63,11,63,12],[59,11,59,12],[51,8,51,10],[51,11,51,12],[55,5,55,7],[55,8,55,10],[55,11,55,12],[56,5,56,7],[56,8,56,10],[56,11,56,12],[54,11,54,12],[52,5,52,7],[57,11,57,12],[58,5,58,7],[58,8,58,10],[58,11,58,12],[57,5,57,7],[53,5,53,7],[54,8,54,10],[57,8,57,10],[47,11,47,12],[52,8,52,10],[52,11,52,12],[53,8,53,10],[53,11,53,12],[47,5,47,7],[47,8,47,10],[48,5,48,7],[48,8,48,10],[51,5,51,7],[45,11,45,12],[48,11,48,12],[49,11,49,12],[50,5,50,7],[50,8,50,10],[50,11,50,12],[49,8,49,10],[49,5,49,7],[46,5,46,7],[46,8,46,10],[35,5,35,7],[35,8,35,10],[35,11,35,12],[36,8,36,10],[36,11,36,12],[36,5,36,7],[46,11,46,12],[45,5,45,7],[45,8,45,10],[37,5,37,7],[37,11,37,12],[37,8,37,10],[42,8,42,10],[39,5,39,7],[38,5,38,7],[38,8,38,10],[32,11,32,12],[32,5,32,7],[32,8,32,10],[34,8,34,10],[33,5,33,7],[33,8,33,10],[33,11,33,12],[34,11,34,12],[34,5,34,7],[38,11,38,12],[41,11,41,12],[43,11,43,12],[44,5,44,7],[44,8,44,10],[44,11,44,12],[43,5,43,7],[43,8,43,10],[39,8,39,10],[42,11,42,12],[39,11,39,12],[42,5,42,7],[40,5,40,7],[40,8,40,10],[40,11,40,12],[41,5,41,7],[41,8,41,10],[60,8,60,10],[74,0,74,1],[55,0,55,1],[73,2,73,3],[59,8,59,10],[74,8,74,10],[69,5,69,7],[72,5,72,7],[70,5,70,7],[65,5,65,7],[54,5,54,7],[65,2,65,3],[57,2,57,3],[58,2,58,3],[59,2,59,3],[59,5,59,7],[60,5,60,7],[61,2,61,3],[64,5,64,7],[56,2,56,3],[49,2,49,3],[61,0,61,1],[66,2,66,3],[54,2,54,3],[55,2,55,3],[62,2,62,3],[62,0,62,1],[63,2,63,3],[64,2,64,3],[74,5,74,7],[67,5,67,7],[66,5,66,7],[73,5,73,7],[71,5,71,7],[68,5,68,7],[36,0,36,1],[34,2,34,3],[72,2,72,3],[50,2,50,3],[74,2,74,3],[67,2,67,3],[68,2,68,3],[69,2,69,3],[70,2,70,3],[71,2,71,3],[72,0,72,1],[73,0,73,1],[70,0,70,1],[71,0,71,1],[31,2,31,3],[32,2,32,3],[33,2,33,3],[35,2,35,3],[36,2,36,3],[34,0,34,1],[47,0,47,1],[66,0,66,1],[54,0,54,1],[56,0,56,1],[51,0,51,1],[52,0,52,1],[63,0,63,1],[64,0,64,1],[65,0,65,1],[59,0,59,1],[69,0,69,1],[67,0,67,1],[60,0,60,1],[50,0,50,1],[57,0,57,1],[58,0,58,1],[53,0,53,1],[68,0,68,1],[42,0,42,1],[44,2,44,3],[40,0,40,1],[41,0,41,1],[43,0,43,1],[45,0,45,1],[38,2,38,3],[41,2,41,3],[42,2,42,3],[43,2,43,3],[48,0,48,1],[49,0,49,1],[46,0,46,1],[39,2,39,3],[40,2,40,3],[44,0,44,1],[31,0,31,1],[16,0,16,1],[17,0,17,1],[24,0,24,1],[22,0,22,1],[37,0,37,1],[25,0,25,1],[18,0,18,1],[19,0,19,1],[35,0,35,1],[30,2,30,3],[39,0,39,1],[26,0,26,1],[27,0,27,1],[38,0,38,1],[32,0,32,1],[33,0,33,1],[28,0,28,1],[29,0,29,1],[30,0,30,1],[10,8,10,10],[11,8,11,10],[21,8,21,10],[30,11,30,12],[30,5,30,7],[22,2,22,3],[29,2,29,3],[25,5,25,7],[27,5,27,7],[28,5,28,7],[17,2,17,3],[15,2,15,3],[13,2,13,3],[11,2,11,3],[12,2,12,3],[9,2,9,3],[14,2,14,3],[10,2,10,3],[16,2,16,3],[9,5,9,7],[14,5,14,7],[11,5,11,7],[23,0,23,1],[12,5,12,7],[16,5,16,7],[22,5,22,7],[19,5,19,7],[20,5,20,7],[21,5,21,7],[23,8,23,10],[29,5,29,7],[17,11,17,12],[17,8,17,10],[13,8,13,10],[13,11,13,12],[16,8,16,10],[15,11,15,12],[16,11,16,12],[24,8,24,10],[25,8,25,10],[27,8,27,10],[31,5,31,7],[31,8,31,10],[30,8,30,10],[28,2,28,3],[18,2,18,3],[24,2,24,3],[23,2,23,3],[19,2,19,3],[25,2,25,3],[26,2,26,3],[27,2,27,3],[22,15,22,16],[22,13,22,14],[18,5,18,7],[18,8,18,10],[15,5,15,7],[17,5,17,7],[25,11,25,12],[27,11,27,12],[29,11,29,12],[26,5,26,7],[29,8,29,10],[26,8,26,10],[28,8,28,10],[28,11,28,12],[26,11,26,12],[18,11,18,12],[24,11,24,12],[24,5,24,7],[23,5,23,7],[23,11,23,12],[19,11,19,12],[20,8,20,10],[19,8,19,10],[22,11,22,12],[22,8,22,10],[10,5,10,7],[0,0,0,18],[4,0,4,1],[6,0,7,1],[2,0,2,1],[3,0,3,1],[2,2,2,18],[9,17,9,18],[9,13,9,14],[10,11,10,12],[11,17,11,18],[13,13,13,14],[13,15,13,16],[13,17,13,18],[12,17,12,18],[12,13,12,14],[12,15,12,16],[8,0,8,1],[8,17,8,18],[8,8,8,10],[8,5,8,7],[8,11,8,12],[8,2,8,3],[8,13,8,14],[8,15,8,16],[15,8,15,10],[11,11,11,12],[14,11,14,12],[14,8,14,10],[10,13,10,14],[14,15,14,16],[11,13,11,14],[11,15,11,16],[9,8,9,10],[17,17,17,18],[13,5,13,7],[9,0,9,1],[14,17,14,18],[14,13,14,14],[12,8,12,10],[12,11,12,12],[9,11,9,12],[10,17,10,18],[16,13,16,14],[9,15,9,16],[15,13,15,14],[17,15,17,16],[15,17,15,18],[6,17,7,18],[19,15,19,16],[18,15,18,16],[15,15,15,16],[16,17,16,18],[18,17,18,18],[3,2,3,18],[4,2,4,18],[6,11,7,12],[6,8,7,10],[6,5,7,7],[6,2,7,3],[6,4,7,4],[6,13,7,14],[6,15,7,16],[23,17,23,18],[23,15,23,16],[24,15,24,16],[28,15,28,16],[19,13,19,14],[10,15,10,16],[17,13,17,14],[18,13,18,14],[16,15,16,16],[19,17,19,18],[25,13,25,14],[27,17,27,18],[26,15,26,16],[26,17,26,18],[29,15,29,16],[29,17,29,18],[33,15,33,16],[24,13,24,14],[22,17,22,18],[24,17,24,18],[25,15,25,16],[25,17,25,18],[23,13,23,14],[27,13,27,14],[29,13,29,14],[28,17,28,18],[30,15,30,16],[27,15,27,16],[30,17,30,18],[34,13,34,14],[34,15,34,16],[32,15,32,16],[31,13,31,14],[31,15,31,16],[32,13,32,14],[33,13,33,14],[39,17,39,18],[40,15,40,16],[40,17,40,18],[35,13,35,14],[26,13,26,14],[33,17,33,18],[30,13,30,14],[28,13,28,14],[31,17,31,18],[32,17,32,18],[45,17,45,18],[42,13,42,14],[42,15,42,16],[40,13,40,14],[41,15,41,16],[41,17,41,18],[46,17,46,18],[48,17,48,18],[49,17,49,18],[38,13,38,14],[47,15,47,16],[47,17,47,18],[43,15,43,16],[43,17,43,18],[44,15,44,16],[44,17,44,18],[56,15,56,16],[55,15,55,16],[57,15,57,16],[58,17,58,18],[51,17,51,18],[52,17,52,18],[31,11,31,12],[53,15,53,16],[53,17,53,18],[41,13,41,14],[50,15,50,16],[50,13,50,14],[50,17,50,18],[45,13,45,14],[45,15,45,16],[46,15,46,16],[34,17,34,18],[37,17,37,18],[35,17,35,18],[38,15,38,16],[38,17,38,18],[36,13,36,14],[36,15,36,16],[36,17,36,18],[37,13,37,14],[37,15,37,16],[35,15,35,16],[54,15,54,16],[54,13,54,14],[49,13,49,14],[52,13,52,14],[49,15,49,16],[51,15,51,16],[39,13,39,14],[39,15,39,16],[59,13,59,14],[58,13,58,14],[55,13,55,14],[56,13,56,14],[57,13,57,14],[42,17,42,18],[55,17,55,18],[54,17,54,18],[57,17,57,18],[56,17,56,18],[58,15,58,16],[43,13,43,14],[52,15,52,16],[51,13,51,14],[53,13,53,14],[46,13,46,14],[44,13,44,14],[48,13,48,14],[47,13,47,14],[48,15,48,16],[60,13,60,14],[59,15,59,16],[59,17,59,18],[63,13,63,14],[63,15,63,16],[61,13,61,14],[61,15,61,16],[61,17,61,18],[60,17,60,18],[60,15,60,16],[68,17,68,18],[64,15,64,16],[64,17,64,18],[66,17,66,18],[65,15,65,16],[65,17,65,18],[67,15,67,16],[68,15,68,16],[63,17,63,18],[62,15,62,16],[62,17,62,18],[67,17,67,18],[64,13,64,14],[62,13,62,14],[65,13,65,14],[71,15,71,16],[69,13,69,14],[70,13,70,14],[67,13,67,14],[68,13,68,14],[66,13,66,14],[66,15,66,16],[71,13,71,14],[74,17,74,18],[72,13,72,14],[72,15,72,16],[72,17,72,18],[73,13,73,14],[73,15,73,16],[74,13,74,14],[74,15,74,16],[69,17,69,18],[70,17,70,18],[69,15,69,16],[73,17,73,18],[70,15,70,16],[71,17,71,18]]}
["Výkaz zmien vo vlastnom imaní (v EUR)"]
[]
["Zostavená za obdobie:",null,"1.1.2015 - 30.6.2015"]
["Názov účtovnej jednotky:",null,{"$f":"IF(ISBLANK(Polročná_správa!B12),\"  \",Polročná_správa!B12)","v":"Hornonitrianske bane Prievidza, a.s. v skratke HBP, a.s."}]
["IČO:",null,{"$f":"IF(ISBLANK(Polročná_správa!E6),\"  \",Polročná_správa!E6)","v":"36 005 622"}]
[]
["Názov položky",null,"Základé imanie",null,"Kapitálové rezervy","nerozdelený zisk",null,null,"Vlastné imanie spolu"]
[]
["Zostatok k 1. januáru  2014",null,99651880,null,6119859,-29383660,null,null,76388079]
[]
["Zmeny vo vlastnom imaní"]
["Ostatné ",null,0,null,0,0,null,null,0]
["Čistý zisk vykázaný priamo vo vlastnom imaní",null,0,null,0,0,null,null,0]
["Zisk za obdobie",null,0,null,0,6428886,null,null,6428886]
["Celkom zisky a straty vykázané za obdobie",null,0,null,0,6428886,null,null,6428886]
["Doplnenie rezervného fondu",null,0,null,244990,-244990,null,null,0]
["Zostatok k 30. júnu 2014",null,99651880,null,6364849,-23199764,null,null,82816965]
[]
[]
["Zmeny vo vlastnom imaní"]
["Ostatné ",null,null,0,0,0,null,null,0]
["Čiský zisk vykázaný priamo vo vlasnom imaní",null,null,0,0,0,null,null,0]
["Zisk za obdobie",null,0,null,0,-5464520,null,null,-5464520]
["Celkom zisky a straty vykázané za obdobie",null,0,null,0,-5464520,null,null,-5464520]
[]
["Zostatok k 31. decembru 2014",null,99651880,null,6364849,-28664284,null,null,77352445]
[]
["Zmeny vo vlastnom imaní"]
["Ostatné",null,0,null,0,0,null,null,0]
["Čiský zisk vykázaný priamo vo vlasnom imaní",null,0,null,0,0,null,null,0]
["Zisk za obdobie",null,0,null,0,972045,null,null,972045]
["Celkom zisky a straty vykázané za obdobie",null,0,null,0,972045,null,null,972045]
["Doplnenie rezervého fondu",null,0,null,96436,-96436,null,null,0]
[]
["Zostatok k 30. júnu 2015",null,99651880,null,6461285,-27788675,null,null,78324490]

{"sheet":"P11Výkaz PT podľa IAS","index":5,"n_rows":55,"n_cols":5,"rows_kept":55,"cut":false,"hidden":false,"merged":[[1,0,1,1],[1,2,1,4],[70,0,70,1],[69,0,69,1],[74,0,74,1],[72,0,72,1],[73,0,73,1],[71,0,71,1],[64,0,64,1],[65,0,65,1],[66,0,66,1],[67,0,67,1],[68,0,68,1],[0,0,0,4],[2,0,2,1],[2,2,2,4],[3,0,3,1],[3,2,3,4],[58,0,58,1],[59,0,59,1],[60,0,60,1],[61,0,61,1],[62,0,62,1],[63,0,63,1],[55,0,55,1],[56,0,56,1],[57,0,57,1],[4,2,4,4],[6,0,7,1],[6,2,7,2],[4,0,4,1],[6,3,7,3],[6,4,7,4]]}
["Výkaz peňažných tokov (v EUR)"]
["Za obdobie od do:",null,"1.1.2015 - 30.6.2015"]
["Bezprostredne predchádzajúce obdobie od do:",null,"1.1.2014 - 30.6.2014"]
["Názov účtovnej jednotky:",null,{"$f":"IF(ISBLANK(Polročná_správa!B12),\"  \",Polročná_správa!B12)","v":"Hornonitrianske bane Prievidza, a.s. v skratke HBP, a.s."}]
["IČO:",null,{"$f":"IF(ISBLANK(Polročná_správa!E6),\"  \",Polročná_správa!E6)","v":"36 005 622"}]
[]
["Názov položky",null,"Bod poznámok","Vykazované  obdobie","Porovnateľné obdobie bezprostredne predchádzajúceho účtovného obdobia"]
[null,null,null,null,"Netto"]
["Peňažné toky z bežných činností"]
["Čistý zisk ",null,null,972045,6428886]
["Úpravy o :"]
["Daň z príjmov",null,"26",365,376]
["Odpisy ",null,null,5092222,3732886]
["Aktivácia novozisteného majetku",null,null,0,-58890]
["Zvýšenie/(zníženie) stavu rezerv",null,null,66474,-40084]
["Zvýšenie/(zníženie) stavu z poklesu hodnoty",null,"23",4928974,0]
["Odpis pohľadávky",null,null,660,33]
["Odpis záväzku",null,null,null,0]
["Kurzové straty, zisky ",null,null,-308,1045]
["Výnosové úroky",null,null,-2110,-32298]
["Nákladové úroky ",null,null,161473,93619]
["Zisk, strata z predaja zariadenia ",null,null,-500,-706]
["Ostatné položky nepeňažného charakteru",null,null,23,964]
["Čisté peňažné prostriedky z prevádzkových činností pred zmenami"]
["v pracovnom kapitáli"]
["Zvýšenie/(zníženie) obchodných a ostatných pohľadávok",null,null,-180914,655638]
["Zvýšenie/(zníženie) zásob",null,null,1074599,-3839240]
["Zvýšenie/(zníženie) obchodných a ostatných záväzkov",null,null,-1877802,-1738785]
["Zvýšenie/(zníženie) zamestnaneckých požitkov",null,null,-92163,-11241]
["Zvýšenie/(zníženie) ostatného obežného finančného majetku",null,null,-105171,-104880]
["Zvýšenie/(zníženie) pohľadávok vykázaných v neobežnom majetku",null,null,-29988,38103]
["Peňažné prostriedky z prevádzkových činností",null,null,10007879,5125426]
["Úroky zaplatené",null,null,-161473,-93607]
["Úroky prijaté",null,null,2110,1981]
["Daň z príjmu zaplatená",null,null,-365,-376]
["Čisté peňažné prostriedky použité v prevádzkových činnostiach",null,null,9848151,5033424]
["Peňažné toky z investičných činností"]
["Výdaj za nákup pozemkov, budov a zariadení a nehmotného majetku",null,null,-753391,-2174294]
["Výdaj na nákup finančných investícií",null,null,null,0]
["Výnosy z predaja pozemkov, budov a zariadení",null,null,500,706]
["Výdavky na obstaranie cenných papierov",null,null,0,-6200428]
["Výdavky na poskytnuté dlhodobé pôžičky",null,null,-5098792]
["Prijaté dividendy a podiely na zisku",null,null,0,300000]
["Čisté peňažné prostriedky použité v investičných činnostiach",null,null,-5851683,8074016]
["Peňažné toky z finančných činností"]
["Príjmy z bankových úverov a kontokoretných účtov",null,null,2843531,0]
["Výdavky na splácanie úverov",null,null,-821200,-685547]
["Splátky záväzkov z finančného leasingu",null,null,0,-319680]
["Čisté peňažné prostriedky použité vo finančných činnostiach",null,null,2022331,-1005227]
[]
["Čisté zvýšenie peňažných prostriedkov a peňažných ekvivalentov",null,null,6018799,-4045819]
[]
["Peňažné prostriedky a peňažné ekvivalenty na začiatku obdobia ",null,null,7279977,7877023]
["Dopady kurzových zmien",null,null,-474,-90]
["Peňažné prostriedky a peňažné ekvivalenty na konci obdobia ",null,null,13298302,3831114]

{"sheet":"P14KonsolSúvaha podľa IAS","index":6,"n_rows":58,"n_cols":5,"rows_kept":58,"cut":false,"hidden":false,"merged":[[7,3,8,3],[7,4,8,4],[5,0,5,1],[5,2,5,4],[3,2,3,4],[4,2,4,4],[0,0,0,4],[7,2,8,2],[3,0,3,1],[4,0,4,1],[2,0,2,1],[2,2,2,4],[7,0,8,1]]}
["Výkaz o finančnej situácii priebežnej konsolidovanej účtovnej závierky (v EUR)"]
[]
["Názov účtovnej jednotky:",null,{"$f":"IF(ISBLANK(Polročná_správa!B12),\"   údaj nebol vyplnený   \",Polročná_správa!B12)","v":"Hornonitrianske bane Prievidza, a.s. v skratke HBP, a.s."}]
["IČO:",null,{"$f":"IF(Polročná_správa!E6=0,\"   údaj nebol vyplnený   \",Polročná_správa!E6)","v":"36 005 622"}]
["Za obdobie od do:",null,"1.1.2015-30.6.2015"]
["Bezprostredne predchádzajúce obdobie od do:",null,"1.1.2014-31.12.2014"]
[]
["POLOŽKA",null,"Bod poznámok","Bežné účtovné obdobie","Bezprostredne predchádzajúce\núčtovné obdobie"]
[]
["MAJETOK "]
["Neobežný majetok "]
["Pozemky, budovy, zariadenia",null,3,61924612,71718080]
["Nehmotný dlhodobý majetok",null,4,81688,96112]
["Ostatný finančný majetok",null,5,15764562,10716714]
["Investície do nehnuteľností",null,6,5707258,5492712]
["Emisné kvóty",null,7,630906,510904]
["Investície do pridružených spoločností",null,"8",6517158,6373841]
["Neobežný majetok spolu ",null,null,90626184,94908363]
[]
["Obežný majetok"]
["Zásoby ",null,9,6625170,7766419]
["Obchodné a ostatné pohľadávky",null,10,17256668,17319671]
["Ostatný finančný majetok",null,11,1283874,1183807]
["Daň z príjmov ",null,null,7153,0]
["Peňažné prostriedky a peňažné ekvivalenty",null,null,13788944,7660279]
["Neobežný majetok držaný na predaj",null,12,56298,56232]
["Obežný majetok spolu",null,null,39018107,33986408]
["Majetok spolu ",null,null,129644291,128894771]
[]
[]
["VLASTNÉ  IMANIE A ZÁVÄZKY "]
["Vlastné imanie "]
["Základné imanie ",null,13,99651880,99651880]
["Kapitálové rezervy",null,14,6471736,6374781]
["Nerozdelené zisky (straty)",null,15,-26429374,-27212667]
[null,null,null,79694242,78813994]
["Menšinové podiely ",null,null,19412,28439]
["Vlastné imanie spolu",null,null,79713654,78842433]
[]
["Neobežné záväzky "]
["Bankové úvery",null,16,8139695,7240672]
["Zamestnanecké požitky ",null,17,3453080,3966901]
["Záväzky z finančného leasingu",null,18,0,533]
["Rezerva na rekultivácie nehnuteľností",null,19,9646185,9657420]
["Odložený daňový záväzok",null,null,40821,40821]
["Obchodné a ostatné dlhodobé záväzky",null,20,5379587,5920769]
["Neobežné záväzky spolu",null,null,26659368,26827116]
[]
["Obežné záväzky "]
["Obchodné a ostatné záväzky",null,20,14849099,16097299]
["Daň z príjmov ",null,null,0,10560]
["Zamestnanecké požitky",null,17,915446,493788]
["Záväzky z finančného leasingu",null,18,3608,5946]
["Bankové úvery a kontokorentné účty",null,16,7503016,6617416]
["Rezervy",null,19,100,213]
["Obežné záväzky spolu",null,null,23271269,23225222]
["Záväzky spolu",null,null,49930637,50052338]
["Vlastné imanie a záväzky spolu ",null,null,129644291,128894771]

{"sheet":"P15Konsol výkaz ZaS podľa IAS","index":7,"n_rows":37,"n_cols":5,"rows_kept":37,"cut":false,"hidden":false,"merged":[[2,0,2,1],[2,2,2,4],[5,0,5,1],[5,2,5,4],[7,2,8,2],[7,3,7,4],[7,0,8,1],[0,0,0,4],[3,0,3,1],[3,2,3,4],[4,0,4,1],[4,2,4,4]]}
["Výkaz komplexného výsledku priebežnej konsolidovanej účtovnej závierky  (v EUR)"]
[]
["Názov účtovnej jednotky:",null,{"$f":"IF(ISBLANK(Polročná_správa!B12),\"   údaj nebol vyplnený   \",Polročná_správa!B12)","v":"Hornonitrianske bane Prievidza, a.s. v skratke HBP, a.s."}]
["IČO:",null,{"$f":"IF(Polročná_správa!E6=0,\"   údaj nebol vyplnený   \",Polročná_správa!E6)","v":"36 005 622"}]
["Za bežné obdobie od do:",null,"1.1.2015-30.6.2015"]
["Porovnateľné bezprostredne predchádzajúce obdobie od do:",null,"1.1.2014-30.6.2014"]
[]
["POLOŽKA",null,"Bod poznámok","Skutočnosť v účtovnom období"]
[null,null,null,"Bežné účtovné obdobie","Porovnateľné obdobie bezprostredne predchádzajúceho účtovného obdobia"]
["Výnosy",null,21,62998645,59269217]
[]
["Ostatné prevádzkové výnosy",null,22,629057,423457]
["Zmeny stavu zásob a aktivované vlastné výkony",null,23,-363375,5912436]
["Spotreba surovín, materiálu a služieb ",null,null,-23523600,-26642703]
["Náklady na zamestnanecké požitky",null,null,-27603573,-27895515]
["Odpisy  ",null,null,-5455035,-4170991]
["Zmena poklesu hodnoty neobežného majetku",null,24,-4928974,0]
["Ostatné prevádzkové náklady",null,25,-837849,-756234]
["Prevádzkový zisk/(strata)",null,null,915296,6139667]
["Finančné výnosy",null,null,216754,372816]
["Finančné náklady ",null,null,-392053,-384630]
["Finančné výnosy/(náklady) netto ",null,26,-175299,-11814]
["Podiel na zisku pridružených spoločností",null,null,143391,6781]
["Zisk pred zdanením",null,null,883388,6134634]
["Daň z príjmov",null,27,-369,-400]
["Zisk za obdobie",null,null,883019,6134234]
[]
["Celkový komplexný výsledok za obdobie",null,null,883019,6134234]
[]
["v tom:"]
["Menšinové podiely ",null,null,-8839,-3866]
["Zisk vzťahujúci sa na materskú spoločnosť",null,null,891858,6138100]
[null,null,null,883019,6134234]
[]
["Zisk na akciu"]
["Základný",null,null,0.29704173268182466,2.0443521943788223]
["Redukovaný",null,null,0.29704173268182466,2.0443521943788223]

{"sheet":"P16Výkaz zmien vo VI podľa IAS","index":8,"n_rows":33,"n_cols":15,"rows_kept":33,"cut":false,"hidden":false,"merged":[[6,6,7,7],[6,4,7,5],[6,11,7,12],[0,0,0,18],[2,0,2,1],[2,2,2,18],[3,0,3,1],[3,2,3,18],[1,0,1,1],[1,2,1,18],[8,8,8,10],[8,4,8,5],[8,6,8,7],[9,6,9,7],[4,0,4,1],[6,0,7,1],[6,2,7,3],[6,8,7,10],[4,2,4,18],[6,13,7,14],[19,6,19,7],[18,0,18,1],[18,2,18,3],[18,4,18,5],[18,6,18,7],[8,2,8,3],[9,4,9,5],[10,4,10,5],[11,2,11,3],[11,4,11,5],[19,0,19,1],[19,2,19,3],[19,4,19,5],[16,2,16,3],[13,2,13,3],[11,13,11,14],[10,6,10,7],[9,8,9,10],[8,11,8,12],[8,13,8,14],[9,11,9,12],[9,13,9,14],[10,13,10,14],[10,8,10,10],[11,8,11,10],[13,4,13,5],[13,6,13,7],[12,2,12,3],[12,8,12,10],[12,6,12,7],[12,4,12,5],[11,11,11,12],[10,2,10,3],[9,2,9,3],[20,13,20,14],[17,2,17,3],[17,8,17,10],[17,4,17,5],[17,6,17,7],[15,13,15,14],[16,13,16,14],[15,4,15,5],[15,8,15,9],[16,6,16,7],[17,11,17,12],[16,4,16,5],[16,11,16,12],[12,11,12,12],[12,13,12,14],[14,13,14,14],[13,11,13,12],[14,11,14,12],[15,6,15,7],[15,11,15,12],[13,8,13,10],[11,6,11,7],[10,11,10,12],[19,8,19,9],[19,11,19,12],[19,13,19,14],[17,13,17,14],[18,13,18,14],[18,8,18,9],[18,11,18,12],[13,13,13,14],[21,0,21,1],[21,8,21,9],[23,8,23,9],[22,8,22,9],[21,4,21,5],[22,2,22,3],[22,4,22,5],[23,4,23,5],[23,6,23,7],[20,8,20,9],[20,11,20,12],[15,0,15,1],[14,2,14,3],[14,4,14,5],[20,0,20,1],[14,6,14,7],[14,8,14,9],[16,8,16,10],[15,2,15,3],[20,2,20,3],[20,4,20,5],[20,6,20,7],[23,2,23,3],[22,6,22,7],[21,6,21,7],[21,2,21,3],[33,0,33,1],[33,2,33,3],[33,4,33,5],[33,6,33,7],[24,4,24,5],[24,8,24,10],[24,6,24,7],[29,4,29,5],[32,0,32,1],[28,0,28,1],[28,2,28,3],[26,0,26,1],[30,0,30,1],[29,0,29,1],[29,2,29,3],[27,0,27,1],[30,2,30,3],[25,0,25,1],[25,2,25,3],[27,2,27,3],[26,2,26,3],[30,6,30,7],[31,6,31,7],[28,6,28,7],[27,4,27,5],[27,6,27,7],[30,4,30,5],[25,4,25,5],[25,6,25,7],[32,8,32,10],[31,8,31,9],[26,8,26,10],[26,4,26,5],[28,4,28,5],[26,6,26,7],[27,8,27,10],[28,8,28,10],[33,11,33,12],[33,8,33,10],[29,6,29,7],[24,2,24,3],[30,8,30,10],[29,8,29,10],[32,2,32,3],[32,4,32,5],[32,6,32,7],[25,8,25,10],[21,11,21,12],[23,11,23,12],[22,11,22,12],[21,13,21,14],[23,13,23,14],[27,13,27,14],[27,11,27,12],[33,13,33,14],[30,13,30,14],[29,13,29,14],[31,13,31,14],[32,13,32,14],[22,13,22,14],[28,13,28,14],[32,11,32,12],[24,13,24,14],[25,11,25,12],[25,13,25,14],[26,13,26,14],[26,11,26,12],[24,11,24,12],[30,11,30,12],[28,11,28,12],[29,11,29,12]]}
["Výkaz zmien vo vlastnom imaní (v EUR)"]
["Za obdobie od do:",null,"1.1.2015-30.6.2015"]
["Bezprostredne predchádzajúce obdobie od do:",null,"1.1.2014-31.12.2014"]
["Názov účtovnej jednotky:",null,{"$f":"IF(ISBLANK(Polročná_správa!B12),\"  \",Polročná_správa!B12)","v":"Hornonitrianske bane Prievidza, a.s. v skratke HBP, a.s."}]
["IČO:",null,{"$f":"IF(ISBLANK(Polročná_správa!E6),\"  \",Polročná_správa!E6)","v":"36 005 622"}]
[]
["Názov položky",null,"Základné imanie",null,"Kapitálové rezervy",null,"Nerozdelený zisk",null,"Spolu",null,null,"Menšinové podiely",null,"Vlastné imanie celkom"]
[]
["Zostatok k 1. januáru  2014",null,99651880,null,6123813,null,-27605269,null,78170424,null,null,39155,null,78209579]
["Zmeny vo vlastnom imaní",null,null,null,0,null,898,null,898,null,null,0,null,898]
["Ostatné",null,0,null,0,null,898,null,898,null,null,0,null,898]
["Čistý zisk vykázaný priamo vo vlastnom imaní",null,0,null,0,null,6138100,null,6138100,null,null,-3866,null,6134234]
["Zisk za obdobie",null,0,null,0,null,6138998,null,6138998,null,null,-3866,null,6135132]
["Celkom zisky a straty vykázané za obdobie",null,0,null,251499,null,-251499,null,0,null,null,0,null,0]
["Doplnenie rezervného fondu",null,0,null,0,null,-300000,null,-300000,null,null,0,null,-300000]
["Vyplatenie odmien zo zisku","Vyplatenie odmien zo zisku",0,null,0,null,-37582,null,-37582,null,null,-269,null,-37851]
["Zostatok k 30. júnu 2014",null,99651880,null,6375312,null,-22055352,null,83971840,null,null,35020,null,84006860]
["Zmeny vo vlastnom imaní"]
["Konsolidácia predaja podielu AGRO GTV, s.r.o.",null,0,null,-531,null,506307,null,505776,null,null,0,null,505776]
["Konsolidácia odpisu podielu Carbonium a.s.",null,0,null,0,null,13278,null,13278,null,null,0,null,13278]
["Ostatné","Ostatné",0,null,0,null,-1,null,-1,null,null,0,null,-1]
["Čistý zisk vykázaný priamo vo vlastnom imaní","Čistý zisk vykázaný priamo vo vlastnom imaní",0,null,-531,null,519584,null,519053,null,null,0,null,519053]
["Zisk za obdobie",null,0,null,0,null,-5676899,null,-5676899,null,null,-6581,null,-5683480]
["Celkom zisky a straty vykázané za obdobie",null,0,null,-531,null,-5157315,null,-5157846,null,null,-6581,null,-5164427]
["Zostatok k 31. decembru 2014",null,99651880,null,6374781,null,-27212667,null,78813994,null,null,28439,null,78842433]
["Zmeny vo vlastnom imaní","Zmeny vo vlastnom imaní"]
["Ostatné ","Ostatné ",0,null,0,null,114,null,114,null,null,0,null,114]
["Čistý zisk vykázaný priamo vo vlastnom imaní","Čistý zisk vykázaný priamo vo vlastnom imaní",0,null,0,null,114,null,114,null,null,0,null,114]
["Zisk za obdobie","Zisk za obdobie",0,null,0,null,891858,null,891858,null,null,-8839,null,883019]
["Celkom zisky a straty vykázané za obdobie","Celkom zisky a straty vykázané za obdobie",0,null,0,null,891972,null,891972,null,null,-8839,null,883133]
["Doplnenie rezervného fondu","Doplnenie rezervného fondu",0,null,96955,null,-96955,null,0,null,null,0,null,0]
["Vyplatenie odmien zo zisku","Vyplatenie odmien zo zisku",null,0,null,0,-11724,-11724,-11724,null,null,null,-118,-11912,-11912]
["Zostatok k 30. júnu 2015","Zostatok k 30. júnu 2014",99651880,null,6417736,null,-26429374,null,79694242,null,null,19412,null,79713654]

{"sheet":"P17Výkaz PT podľa IAS","index":9,"n_rows":56,"n_cols":5,"rows_kept":56,"cut":false,"hidden":false,"merged":[[0,0,0,4],[2,0,2,1],[2,2,2,4],[3,0,3,1],[3,2,3,4],[1,0,1,1],[1,2,1,4],[4,0,4,1],[4,2,4,4],[6,0,7,1],[6,2,7,2],[6,3,7,3],[6,4,7,4]]}
["Výkaz peňažných tokov (v EUR)"]
["Za obdobie od do:",null,"1.1.2015-30.6.2015"]
["Bezprostredne predchádzajúce obdobie od do:",null,"1.1.2014-30.6.2014"]
["Názov účtovnej jednotky:",null,{"$f":"IF(ISBLANK(Polročná_správa!B12),\"  \",Polročná_správa!B12)","v":"Hornonitrianske bane Prievidza, a.s. v skratke HBP, a.s."}]
["IČO:",null,{"$f":"IF(ISBLANK(Polročná_správa!E6),\"  \",Polročná_správa!E6)","v":"36 005 622"}]
[]
["Názov položky",null,"Bod poznámok","Vykazované  obdobie","Porovnateľné obdobie bezprostredne predchádzajúceho účtovného obdobia"]
[null,null,null,null,"Netto"]
["Peňažné toky z bežných činností"]
["Čistý zisk ",null,15,883019,6134234]
["Úpravy o :"]
["Daň z príjmov",null,27,369,400]
["Odpisy ",null,null,5455035,4170991]
["Aktivácia novozisteného majetku",null,null,0,-58890]
["Zvýšenie/(zníženie) stavu rezerv",null,null,66474,-40084]
["Zvýšenie/(zníženie) stavu z poklesu hodnoty",null,24,4928974,0]
["Odpis pohľadávky",null,null,660,33]
["Kurzové straty, zisky ",null,null,-308,1045]
["Výnosové úroky",null,null,-2140,-32593]
["Nákladové úroky ",null,null,222943,190638]
["Zisk, strata z predaja zariadenia ",null,null,-10783,-706]
["Podiel na zisku pridružených spoločností",null,null,-143391,-6781]
["Ostatné položky nepeňažného charakteru",null,null,23,962]
["Čisté peňažné prostriedky z prevádzkových činností "]
["pred zmenami v pracovnom kapitáli"]
["Zvýšenie/(zníženie) obchodných a ostatných pohľadávok",null,null,63003,1919456]
["Zvýšenie/(zníženie) zásob",null,null,1141249,-4221154]
["Zvýšenie/(zníženie) obchodných a ostatných záväzkov",null,null,-1789382,-2438580]
["Zvýšenie/(zníženie) zamestnaneckých požitkov",null,null,-92163,-11241]
["Zvýšenie/(zníženie) ostatného obežného finančného majetku",null,null,-220069,-214241]
["Zvýšenie/(zníženie) pohľadávok vykázaných v neobežnom majetku",null,null,-29988,38103]
["Peňažné prostriedky z prevádzkových činností",null,null,10473525,5431592]
["Úroky zaplatené",null,null,-163823,-129575]
["Úroky prijaté",null,null,2140,2276]
["Daň z príjmu ",null,null,13412,-15051]
["Čisté peňažné prostriedky použité v prevádzkových činnostiach",null,null,10325254,5289242]
["Peňažné toky z investičných činností"]
["Výdaj za nákup pozemkov, budov a zariadení a nehmotného majetku",null,null,-821776,-3324127]
["Výnosy z predaja pozemkov, budov a zariadení",null,null,14333,706]
["Výdavky na obstaranie cenných papierov",null,null,0,-6200428]
["Príjmy z predaja dlhodobých cenných papierov",null,null,0,2625]
["Výdavky na poskytnuté dlhodobé pôžičky",null,null,-5098792,0]
["Čisté peňažné prostriedky použité v investičných činnostiach",null,null,-5906235,-9521224]
["Peňažné toky z finančných činností"]
["Príjmy z bankových úverov a kontokorentných účtov",null,null,2843531,1509600]
["Výdavky na splácanie úverov",null,null,-1058908,-878255]
["Splátky záväzkov z finančného leasingu",null,null,-3796,-316808]
["Výdavky na zaplatené úroky",null,null,-63983,-57630]
["Výdavky na vyplatené podiely na zisku",null,null,-6724,-37583]
["Čisté peňažné prostriedky použité vo finančných činnostiach",null,null,1710120,219324]
[]
["Čisté zvýšenie peňažných prostriedkov a peňažných ekvivalentov",null,null,6129139,-4012658]
[]
["Peňažné prostriedky a peňažné ekvivalenty na začiatku obdobia ",null,null,7660279,9108090]
["Dopady kurzových zmien",null,null,-474,-90]
["Peňažné prostriedky a peňažné ekvivalenty na konci obdobia ",null,null,13788944,5095342]

{"sheet":"KONTROLA","index":10,"n_rows":10,"n_cols":2,"rows_kept":10,"cut":false,"hidden":false,"merged":[[1,0,1,1]]}
[]
["Kontrolný list "]
["Typ formálnej kontroly","Výsledok formálnej kontroly"]
["Informačná povinnosť za rok",{"$f":"IF(Polročná_správa!B6=0,\"Položka Informačná povinnosť za rok nie je vyplnená\",\"Test vyhovel formálnej kontrole\")","v":"Test vyhovel formálnej kontrole"}]
["IČO",{"$f":"IF(Polročná_správa!E6=0,\"Položka IČO nie je vyplnená\",\"Test vyhovel formálnej kontrole\")","v":"Test vyhovel formálnej kontrole"}]
["Obchodné meno",{"$f":"IF(Polročná_správa!B12=0,\"Položka Obchodné meno/názov nie je vyplnená\",\"Test vyhovel formálnej kontrole\")","v":"Test vyhovel formálnej kontrole"}]
["Zverejnenie ročnej správy, ",{"$f":"IF(Polročná_správa!F38=0,\"Položka Dátum zverejnenia ročnej správy nie je vyplnená\",\"Test vyhovel formálnej kontrole\")","v":"Test vyhovel formálnej kontrole"}]
["Údaj o audite",{"$f":"IF(Polročná_správa!A83=0,\"Položka Obchodné meno audítorskej spoločnosti... nie je vyplnená\",\"Test vyhovel formálnej kontrole\")","v":"Položka Obchodné meno audítorskej spoločnosti... nie je vyplnená"}]
["Údaj o konsolid. účt. závierke",{"$f":"IF(Polročná_správa!G89=0,\"Položka Zostavuje konsolidovanú účtovnú závierku nie je vyplnená\",\"Test vyhovel formálnej kontrole\")","v":"Test vyhovel formálnej kontrole"}]
["Vyhlásenie zodpovedných osôb emitenta",{"$f":"IF(Polročná_správa!A155=0,\"Položka Vyhlásenie zodpovedných osôb emitenta nie je vyplnená\",\"Test vyhovel formálnej kontrole\")","v":"Test vyhovel formálnej kontrole"}]